Reaction Details
TargetCannabinoid receptor 1
LigandBDBM50270539
Substrate/Competitorn/a
Meas. Tech.ChEMBL_552827 (CHEMBL957298)
Ki 116±n/a nM
Citation Zhang, YBurgess, JPBrackeen, MGilliam, AMascarella, SWPage, KSeltzman, HHThomas, BF Conformationally constrained analogues of N-(piperidinyl)-5-(4-chlorophenyl)-1-(2,4- dichlorophenyl)-4-methyl-1H-pyrazole-3-carboxamide (SR141716): design, synthesis, computational analysis, and biological evaluations. J Med Chem51:3526-39 (2008) 
 
Cannabinoid receptor 1
Name:Cannabinoid receptor 1
Type:G Protein-Coupled Receptor (GPCR)
Mol. Mass.:52868.96
Organism:Homo sapiens (Human)
Description:P21554
Residue:472
BDBM50270539
NameBDBM50270539
Synonyms:5-(4-Chloro-2,6-dimethylphenyl)-1-(2,4-dichlorophenyl)-4-methyl-N-piperidin-1-yl-1H-pyrazole-3-carboxamide | CHEMBL478160
TypeSmall organic molecule
Emp. Form.C24H25Cl3N4O
Mol. Mass.491.84
SMILESCc1c(nn(c1-c1c(C)cc(Cl)cc1C)-c1ccc(Cl)cc1Cl)C(=O)NN1CCCCC1