Reaction Details
TargetCannabinoid receptor 2
LigandBDBM50271288
Substrate/Competitorn/a
Meas. Tech.ChEMBL_552828 (CHEMBL957299)
Ki 1781±n/a nM
Citation Zhang, YBurgess, JPBrackeen, MGilliam, AMascarella, SWPage, KSeltzman, HHThomas, BF Conformationally constrained analogues of N-(piperidinyl)-5-(4-chlorophenyl)-1-(2,4- dichlorophenyl)-4-methyl-1H-pyrazole-3-carboxamide (SR141716): design, synthesis, computational analysis, and biological evaluations. J Med Chem51:3526-39 (2008) 
 
Cannabinoid receptor 2
Name:Cannabinoid receptor 2
Type:G Protein-Coupled Receptor (GPCR)
Mol. Mass.:39690.94
Organism:Homo sapiens (Human)
Description:P34972
Residue:360
BDBM50271288
NameBDBM50271288
Synonyms:5-(4-Chloro-2-methylphenyl)-4-methyl-N-piperidin-1-yl-1-(2,4,6-trichlorophenyl)-1H-pyrazole-3-carboxamide | CHEMBL484506
TypeSmall organic molecule
Emp. Form.C23H22Cl4N4O
Mol. Mass.512.259
SMILESCc1c(nn(c1-c1ccc(Cl)cc1C)-c1c(Cl)cc(Cl)cc1Cl)C(=O)NN1CCCCC1