Reaction Details
TargetD(3) dopamine receptor
LigandBDBM50007522
Substrate/Competitorn/a
Meas. Tech.ChEMBL_491100 (CHEMBL982123)
Ki 0.22±n/a nM
Citation Airaksinen, AJNag, SFinnema, SJMukherjee, JChattopadhyay, SGulyás, BFarde, LHalldin, C [11C]cyclopropyl-FLB 457: a PET radioligand for low densities of dopamine D2 receptors. Bioorg Med Chem16:6467-73 (2008) 
 
D(3) dopamine receptor
Name:D(3) dopamine receptor
Type:n/a
Mol. Mass.:44243.43
Organism:Homo sapiens (Human)
Description:n/a
Residue:400
BDBM50007522
NameBDBM50007522
Synonyms:5-Bromo-N-(1-ethyl-pyrrolidin-2-ylmethyl)-2,3-dimethoxy-benzamide CHEMBL289330
TypeSmall organic molecule
Emp. Form.C16H23BrN2O3
Mol. Mass.371.269
SMILESCCN1CCC[C@H]1CNC(=O)c1cc(Br)cc(OC)c1OC