Reaction Details
TargetC-C chemokine receptor type 4
LigandBDBM50244125
Substrate/Competitorn/a
Meas. Tech.ChEMBL_491885 (CHEMBL946415)
IC50 31±n/a nM
Citation Yokoyama, KIshikawa, NIgarashi, SKawano, NHattori, KMiyazaki, TOgino, SMatsumoto, YTakeuchi, MOhta, M Discovery of potent CCR4 antagonists: Synthesis and structure-activity relationship study of 2,4-diaminoquinazolines. Bioorg Med Chem16:7021-32 (2008) 
 
C-C chemokine receptor type 4
Name:C-C chemokine receptor type 4
Type:Enzyme
Mol. Mass.:41406.41
Organism:Homo sapiens (Human)
Description:P51679
Residue:360
BDBM50244125
NameBDBM50244125
Synonyms:CHEMBL516936 | N-cycloheptyl-6-methoxy-2-(4-(pyrrolidin-1-yl)piperidin-1-yl)quinazolin-4-amine
TypeSmall organic molecule
Emp. Form.C25H37N5O
Mol. Mass.423.5942
SMILESCOc1ccc2nc(nc(NC3CCCCCC3)c2c1)N1CCC(CC1)N1CCCC1