Reaction Details
TargetPotassium voltage-gated channel subfamily H member 2
LigandBDBM50243844
Substrate/Competitorn/a
Meas. Tech.ChEMBL_492219 (CHEMBL952419)
IC50 88±n/a nM
Citation Shipe, WDBarrow, JCYang, ZQLindsley, CWYang, FVSchlegel, KAShu, YRittle, KEBock, MGHartman, GDTang, CBallard, JEKuo, YAdarayan, EDPrueksaritanont, TZrada, MMUebele, VNNuss, CEConnolly, TMDoran, SMFox, SVKraus, RLMarino, MJGraufelds, VKVargas, HMBunting, PBHasbun-Manning, MEvans, RMKoblan, KSRenger, JJ Design, synthesis, and evaluation of a novel 4-aminomethyl-4-fluoropiperidine as a T-type Ca2+ channel antagonist. J Med Chem51:3692-5 (2008) 
 
Potassium voltage-gated channel subfamily H member 2
Name:Potassium voltage-gated channel subfamily H member 2
Type:Multi-pass membrane protein
Mol. Mass.:126672.65
Organism:Homo sapiens (Human)
Description:Q12809
Residue:1159
BDBM50243844
NameBDBM50243844
Synonyms:1-(3-Chloro-phenyl)-3-[1-(3,3-dimethyl-butyl)-4-phenyl-piperidin-4-ylmethyl]-urea CHEMBL488294
TypeSmall organic molecule
Emp. Form.C25H34ClN3O
Mol. Mass.428.01
SMILESCC(C)(C)CCN1CCC(CNC(=O)Nc2cccc(Cl)c2)(CC1)c1ccccc1