Reaction Details
TargetCyclin-dependent kinase 2-associated protein 1
LigandBDBM50243473
Substrate/Competitorn/a
Meas. Tech.ChEMBL_491562 (CHEMBL944208)
IC50>100000±n/a nM
Citation Janetka, JWAlmeida, LAshwell, SBrassil, PJDaly, KDeng, CGero, TGlynn, REHorn, CLIoannidis, SLyne, PNewcombe, NJOza, VBPass, MSpringer, SKSu, MToader, DVasbinder, MMYu, DYu, YZabludoff, SD Discovery of a novel class of 2-ureido thiophene carboxamide checkpoint kinase inhibitors. Bioorg Med Chem Lett18:4242-8 (2008) 
 
Cyclin-dependent kinase 2-associated protein 1
Name:Cyclin-dependent kinase 2-associated protein 1
Type:PROTEIN
Mol. Mass.:12370.40
Organism:Homo sapiens (Human)
Description:ChEMBL_491562
Residue:115
BDBM50243473
NameBDBM50243473
Synonyms:1-(5-(4-(2-(diethylamino)ethoxy)phenyl)-3-(pyrrolidin-3-ylcarbamoyl)thiophen-2-yl)urea | CHEMBL460889
TypeSmall organic molecule
Emp. Form.C22H31N5O3S
Mol. Mass.445.578
SMILESCCN(CC)CCOc1ccc(cc1)-c1cc(C(=O)NC2CCNC2)c(NC(N)=O)s1