Reaction Details
TargetCyclin-dependent kinase 2-associated protein 1
LigandBDBM50243046
Substrate/Competitorn/a
Meas. Tech.ChEMBL_491562 (CHEMBL944208)
IC50 3700±n/a nM
Citation Janetka, JWAlmeida, LAshwell, SBrassil, PJDaly, KDeng, CGero, TGlynn, REHorn, CLIoannidis, SLyne, PNewcombe, NJOza, VBPass, MSpringer, SKSu, MToader, DVasbinder, MMYu, DYu, YZabludoff, SD Discovery of a novel class of 2-ureido thiophene carboxamide checkpoint kinase inhibitors. Bioorg Med Chem Lett18:4242-8 (2008) 
 
Cyclin-dependent kinase 2-associated protein 1
Name:Cyclin-dependent kinase 2-associated protein 1
Type:PROTEIN
Mol. Mass.:12370.40
Organism:Homo sapiens (Human)
Description:ChEMBL_491562
Residue:115
BDBM50243046
NameBDBM50243046
Synonyms:(S)-1-(5-(4-chlorophenyl)-3-(piperidin-3-ylcarbamoyl)thiophen-2-yl)urea CHEMBL470288
TypeSmall organic molecule
Emp. Form.C17H19ClN4O2S
Mol. Mass.378.876
SMILESNC(=O)Nc1sc(cc1C(=O)N[C@H]1CCCNC1)-c1ccc(Cl)cc1