Reaction Details
TargetProgesterone receptor
LigandBDBM50243395
Substrate/Competitorn/a
Meas. Tech.ChEMBL_491263 (CHEMBL989216)
Ki 14±n/a nM
Citation Pedram, Bvan Oeveren, AMais, DEMarschke, KBVerbost, PMGroen, MBZhi, L A tissue-selective nonsteroidal progesterone receptor modulator: 7,9-difluoro-5-(3-methylcyclohex-2-enyl)-2,2,4-trimethyl-1,2-dihydrochromeno[3,4-f]quinoline. J Med Chem51:3696-9 (2008) 
 
Progesterone receptor
Name:Progesterone receptor
Type:Protein
Mol. Mass.:98979.52
Organism:Homo sapiens (Human)
Description:P06401
Residue:933
BDBM50243395
NameBDBM50243395
Synonyms:CHEMBL510373 | rac, anti-7,9-difluoro-5-(3-methylcyclohex-2-en-1-yl)-2,2,4-trimethyl 2,5-dihydro-(1H)6-oxa-1-aza-chrysen
TypeSmall organic molecule
Emp. Form.C26H27F2NO
Mol. Mass.407.4955
SMILESCC1=C[C@@H](CCC1)[C@@H]1Oc2c(F)cc(F)cc2-c2ccc3NC(C)(C)C=C(C)c3c12