Reaction Details
TargetAdenosine receptor A2a
LigandBDBM50243027
Substrate/Competitorn/a
Meas. Tech.ChEMBL_491362 (CHEMBL986416)
Ki 1.5±n/a nM
Citation Shah, ULankin, CMBoyle, CDChackalamannil, SGreenlee, WJNeustadt, BRCohen-Williams, MEHiggins, GANg, KVarty, GBZhang, HLachowicz, JE Design, synthesis, and evaluation of fused heterocyclic analogs of SCH 58261 as adenosine A2A receptor antagonists. Bioorg Med Chem Lett18:4204-9 (2008) 
 
Adenosine receptor A2a
Name:Adenosine receptor A2a
Type:G Protein-Coupled Receptor (GPCR)
Mol. Mass.:44716.46
Organism:Homo sapiens (Human)
Description:P29274
Residue:412
BDBM50243027
NameBDBM50243027
Synonyms:2-Furan-2-yl-7-{2-[8-(2-methoxy-ethoxy)-3,4-dihydro-1H-isoquinolin-2-yl]-ethyl}-7H-pyrazolo[4,3-e][1,2,4]triazolo[1,5-c]pyrimidin-5-ylamine | CHEMBL512133
TypeSmall organic molecule
Emp. Form.C24H26N8O3
Mol. Mass.474.515
SMILESCOCCOc1cccc2CCN(CCn3ncc4c3nc(N)n3nc(nc43)-c3ccco3)Cc12