Reaction Details
TargetAdenosine receptor A2a
LigandBDBM50252166
Substrate/Competitorn/a
Meas. Tech.ChEMBL_491756 (CHEMBL937827)
Ki 2.3±n/a nM
Citation Shah, UBoyle, CDChackalamannil, SNeustadt, BRLindo, NGreenlee, WJFoster, CArik, LZhai, YNg, KWang, SMonopoli, ALachowicz, JE Biaryl and heteroaryl derivatives of SCH 58261 as potent and selective adenosine A2A receptor antagonists. Bioorg Med Chem Lett18:4199-203 (2008) 
 
Adenosine receptor A2a
Name:Adenosine receptor A2a
Type:G Protein-Coupled Receptor (GPCR)
Mol. Mass.:44716.46
Organism:Homo sapiens (Human)
Description:P29274
Residue:412
BDBM50252166
NameBDBM50252166
Synonyms:2-Furan-2-yl-7-[2-(2-morpholin-4-ylmethyl-quinolin-6-yl)-ethyl]-7H-pyrazolo[4,3-e][1,2,4]triazolo[1,5-c]pyrimidin-5-ylamine | CHEMBL481147
TypeSmall organic molecule
Emp. Form.C26H25N9O2
Mol. Mass.495.5358
SMILESNc1nc2n(CCc3ccc4nc(CN5CCOCC5)ccc4c3)ncc2c2nc(nn12)-c1ccco1