Reaction Details
TargetAdenosine receptor A2a
LigandBDBM50252111
Substrate/Competitorn/a
Meas. Tech.ChEMBL_491756 (CHEMBL937827)
Ki 5.5±n/a nM
Citation Shah, UBoyle, CDChackalamannil, SNeustadt, BRLindo, NGreenlee, WJFoster, CArik, LZhai, YNg, KWang, SMonopoli, ALachowicz, JE Biaryl and heteroaryl derivatives of SCH 58261 as potent and selective adenosine A2A receptor antagonists. Bioorg Med Chem Lett18:4199-203 (2008) 
 
Adenosine receptor A2a
Name:Adenosine receptor A2a
Type:G Protein-Coupled Receptor (GPCR)
Mol. Mass.:44716.46
Organism:Homo sapiens (Human)
Description:P29274
Residue:412
BDBM50252111
NameBDBM50252111
Synonyms:2-Furan-2-yl-7-[2-(3-pyridin-3-yl-phenyl)-ethyl]-7H-pyrazolo[4,3-e][1,2,4]triazolo[1,5-c]pyrimidin-5-ylamine | CHEMBL519282
TypeSmall organic molecule
Emp. Form.C23H18N8O
Mol. Mass.422.442
SMILESNc1nc2n(CCc3cccc(c3)-c3cccnc3)ncc2c2nc(nn12)-c1ccco1