Reaction Details
TargetSodium-dependent serotonin transporter
LigandBDBM50252119
Substrate/Competitorn/a
Meas. Tech.ChEMBL_487515 (CHEMBL1012267)
IC50 3±n/a nM
Citation Middleton, DSAndrews, MGlossop, PGymer, GHepworth, DJessiman, AJohnson, PSMackenny, MPitcher, MJRooker, TStobie, ATang, KMorgan, P Designing rapid onset selective serotonin re-uptake inhibitors. 2: structure-activity relationships of substituted (aryl)benzylamines. Bioorg Med Chem Lett18:4018-21 (2008) 
 
Sodium-dependent serotonin transporter
Name:Sodium-dependent serotonin transporter
Type:Multi-pass membrane protein
Mol. Mass.:70322.51
Organism:Homo sapiens (Human)
Description:P31645
Residue:630
BDBM50252119
NameBDBM50252119
Synonyms:CHEMBL449015 | N-(3-((dimethylamino)methyl)-4-(4-(methylthio)phenylthio)phenyl)methanesulfonamide
TypeSmall organic molecule
Emp. Form.C17H22N2O2S3
Mol. Mass.382.564
SMILESCSc1ccc(Sc2ccc(NS(C)(=O)=O)cc2CN(C)C)cc1