Reaction Details
TargetSodium-dependent serotonin transporter
LigandBDBM50252016
Substrate/Competitorn/a
Meas. Tech.ChEMBL_487515 (CHEMBL1012267)
IC50 17±n/a nM
Citation Middleton, DSAndrews, MGlossop, PGymer, GHepworth, DJessiman, AJohnson, PSMackenny, MPitcher, MJRooker, TStobie, ATang, KMorgan, P Designing rapid onset selective serotonin re-uptake inhibitors. 2: structure-activity relationships of substituted (aryl)benzylamines. Bioorg Med Chem Lett18:4018-21 (2008) 
 
Sodium-dependent serotonin transporter
Name:Sodium-dependent serotonin transporter
Type:Multi-pass membrane protein
Mol. Mass.:70322.51
Organism:Homo sapiens (Human)
Description:P31645
Residue:630
BDBM50252016
NameBDBM50252016
Synonyms:(2-(4-cyclopropylphenoxy)phenyl)-N,N-dimethylmethanamine | CHEMBL507422
TypeSmall organic molecule
Emp. Form.C18H21NO
Mol. Mass.267.3654
SMILESCN(C)Cc1ccccc1Oc1ccc(cc1)C1CC1