Reaction Details
TargetSodium-dependent dopamine transporter
LigandBDBM50252168
Substrate/Competitorn/a
Meas. Tech.ChEMBL_487516 (CHEMBL1012268)
IC50>10000±n/a nM
Citation Middleton, DSAndrews, MGlossop, PGymer, GHepworth, DJessiman, AJohnson, PSMackenny, MPitcher, MJRooker, TStobie, ATang, KMorgan, P Designing rapid onset selective serotonin re-uptake inhibitors. 2: structure-activity relationships of substituted (aryl)benzylamines. Bioorg Med Chem Lett18:4018-21 (2008) 
 
Sodium-dependent dopamine transporter
Name:Sodium-dependent dopamine transporter
Type:Multi-pass membrane protein
Mol. Mass.:68497.11
Organism:Homo sapiens (Human)
Description:Q01959
Residue:620
BDBM50252168
NameBDBM50252168
Synonyms:3-((dimethylamino)methyl)-4-(4-(trifluoromethoxy)phenoxy)benzamide | CHEMBL481695
TypeSmall organic molecule
Emp. Form.C17H17F3N2O3
Mol. Mass.354.3237
SMILESCN(C)Cc1cc(ccc1Oc1ccc(OC(F)(F)F)cc1)C(N)=O