Reaction Details
TargetSodium-dependent dopamine transporter
LigandBDBM50252021
Substrate/Competitorn/a
Meas. Tech.ChEMBL_487516 (CHEMBL1012268)
IC50 105±n/a nM
Citation Middleton, DSAndrews, MGlossop, PGymer, GHepworth, DJessiman, AJohnson, PSMackenny, MPitcher, MJRooker, TStobie, ATang, KMorgan, P Designing rapid onset selective serotonin re-uptake inhibitors. 2: structure-activity relationships of substituted (aryl)benzylamines. Bioorg Med Chem Lett18:4018-21 (2008) 
 
Sodium-dependent dopamine transporter
Name:Sodium-dependent dopamine transporter
Type:Multi-pass membrane protein
Mol. Mass.:68497.11
Organism:Homo sapiens (Human)
Description:Q01959
Residue:620
BDBM50252021
NameBDBM50252021
Synonyms:4-(3,4-dichlorobenzyl)-3-((methylamino)methyl)benzamide | CHEMBL451165
TypeSmall organic molecule
Emp. Form.C16H16Cl2N2O
Mol. Mass.323.217
SMILESCNCc1cc(ccc1Cc1ccc(Cl)c(Cl)c1)C(N)=O