Reaction Details
TargetSodium-dependent dopamine transporter
LigandBDBM50251872
Substrate/Competitorn/a
Meas. Tech.ChEMBL_487516 (CHEMBL1012268)
IC50 6400±n/a nM
Citation Middleton, DSAndrews, MGlossop, PGymer, GHepworth, DJessiman, AJohnson, PSMackenny, MPitcher, MJRooker, TStobie, ATang, KMorgan, P Designing rapid onset selective serotonin re-uptake inhibitors. 2: structure-activity relationships of substituted (aryl)benzylamines. Bioorg Med Chem Lett18:4018-21 (2008) 
 
Sodium-dependent dopamine transporter
Name:Sodium-dependent dopamine transporter
Type:Multi-pass membrane protein
Mol. Mass.:68497.11
Organism:Homo sapiens (Human)
Description:Q01959
Residue:620
BDBM50251872
NameBDBM50251872
Synonyms:(2-(4-ethoxyphenoxy)phenyl)-N,N-dimethylmethanamine | CHEMBL481526
TypeSmall organic molecule
Emp. Form.C17H21NO2
Mol. Mass.271.3541
SMILESCCOc1ccc(Oc2ccccc2CN(C)C)cc1