Reaction Details
TargetSodium-dependent dopamine transporter
LigandBDBM50233472
Substrate/Competitorn/a
Meas. Tech.ChEMBL_487516 (CHEMBL1012268)
IC50 910±n/a nM
Citation Middleton, DSAndrews, MGlossop, PGymer, GHepworth, DJessiman, AJohnson, PSMackenny, MPitcher, MJRooker, TStobie, ATang, KMorgan, P Designing rapid onset selective serotonin re-uptake inhibitors. 2: structure-activity relationships of substituted (aryl)benzylamines. Bioorg Med Chem Lett18:4018-21 (2008) 
 
Sodium-dependent dopamine transporter
Name:Sodium-dependent dopamine transporter
Type:Multi-pass membrane protein
Mol. Mass.:68497.11
Organism:Homo sapiens (Human)
Description:Q01959
Residue:620
BDBM50233472
NameBDBM50233472
Synonyms:(2-(3-chlorophenoxy)phenyl)-N,N-dimethylmethanamine | CHEMBL257424
TypeSmall organic molecule
Emp. Form.C15H16ClNO
Mol. Mass.261.747
SMILESCN(C)Cc1ccccc1Oc1cccc(Cl)c1