Reaction Details
TargetSodium-dependent noradrenaline transporter
LigandBDBM50252121
Substrate/Competitorn/a
Meas. Tech.ChEMBL_487517 (CHEMBL1012269)
IC50>10000±n/a nM
Citation Middleton, DSAndrews, MGlossop, PGymer, GHepworth, DJessiman, AJohnson, PSMackenny, MPitcher, MJRooker, TStobie, ATang, KMorgan, P Designing rapid onset selective serotonin re-uptake inhibitors. 2: structure-activity relationships of substituted (aryl)benzylamines. Bioorg Med Chem Lett18:4018-21 (2008) 
 
Sodium-dependent noradrenaline transporter
Name:Sodium-dependent noradrenaline transporter
Type:Multi-pass membrane protein
Mol. Mass.:69337.72
Organism:Homo sapiens (Human)
Description:P23975
Residue:617
BDBM50252121
NameBDBM50252121
Synonyms:3-((dimethylamino)methyl)-4-(4-(trifluoromethoxy)phenoxy)benzenesulfonamide | CHEMBL479409
TypeSmall organic molecule
Emp. Form.C16H17F3N2O4S
Mol. Mass.390.377
SMILESCN(C)Cc1cc(ccc1Oc1ccc(OC(F)(F)F)cc1)S(N)(=O)=O