Reaction Details
TargetSodium-dependent noradrenaline transporter
LigandBDBM50252021
Substrate/Competitorn/a
Meas. Tech.ChEMBL_487517 (CHEMBL1012269)
IC50 50±n/a nM
Citation Middleton, DSAndrews, MGlossop, PGymer, GHepworth, DJessiman, AJohnson, PSMackenny, MPitcher, MJRooker, TStobie, ATang, KMorgan, P Designing rapid onset selective serotonin re-uptake inhibitors. 2: structure-activity relationships of substituted (aryl)benzylamines. Bioorg Med Chem Lett18:4018-21 (2008) 
 
Sodium-dependent noradrenaline transporter
Name:Sodium-dependent noradrenaline transporter
Type:Multi-pass membrane protein
Mol. Mass.:69337.72
Organism:Homo sapiens (Human)
Description:P23975
Residue:617
BDBM50252021
NameBDBM50252021
Synonyms:4-(3,4-dichlorobenzyl)-3-((methylamino)methyl)benzamide | CHEMBL451165
TypeSmall organic molecule
Emp. Form.C16H16Cl2N2O
Mol. Mass.323.217
SMILESCNCc1cc(ccc1Cc1ccc(Cl)c(Cl)c1)C(N)=O