Reaction Details
TargetSodium-dependent noradrenaline transporter
LigandBDBM50251872
Substrate/Competitorn/a
Meas. Tech.ChEMBL_487517 (CHEMBL1012269)
IC50 1500±n/a nM
Citation Middleton, DSAndrews, MGlossop, PGymer, GHepworth, DJessiman, AJohnson, PSMackenny, MPitcher, MJRooker, TStobie, ATang, KMorgan, P Designing rapid onset selective serotonin re-uptake inhibitors. 2: structure-activity relationships of substituted (aryl)benzylamines. Bioorg Med Chem Lett18:4018-21 (2008) 
 
Sodium-dependent noradrenaline transporter
Name:Sodium-dependent noradrenaline transporter
Type:Multi-pass membrane protein
Mol. Mass.:69337.72
Organism:Homo sapiens (Human)
Description:P23975
Residue:617
BDBM50251872
NameBDBM50251872
Synonyms:(2-(4-ethoxyphenoxy)phenyl)-N,N-dimethylmethanamine | CHEMBL481526
TypeSmall organic molecule
Emp. Form.C17H21NO2
Mol. Mass.271.3541
SMILESCCOc1ccc(Oc2ccccc2CN(C)C)cc1