Reaction Details
TargetSodium-dependent serotonin transporter
LigandBDBM50252172
Substrate/Competitorn/a
Meas. Tech.ChEMBL_487515 (CHEMBL1012267)
IC50 1±n/a nM
Citation Middleton, DSAndrews, MGlossop, PGymer, GHepworth, DJessiman, AJohnson, PSMackenny, MPitcher, MJRooker, TStobie, ATang, KMorgan, P Designing rapid onset selective serotonin re-uptake inhibitors. 2: structure-activity relationships of substituted (aryl)benzylamines. Bioorg Med Chem Lett18:4018-21 (2008) 
 
Sodium-dependent serotonin transporter
Name:Sodium-dependent serotonin transporter
Type:Multi-pass membrane protein
Mol. Mass.:70322.51
Organism:Homo sapiens (Human)
Description:P31645
Residue:630
BDBM50252172
NameBDBM50252172
Synonyms:5-(3,4-dichlorophenyl)-8-(methylamino)-5,6,7,8-tetrahydronaphthalene-2-sulfonamide | CHEMBL443964
TypeSmall organic molecule
Emp. Form.C17H18Cl2N2O2S
Mol. Mass.385.308
SMILESCNC1CCC(c2ccc(Cl)c(Cl)c2)c2ccc(cc12)S(N)(=O)=O