Reaction Details
TargetSodium-dependent serotonin transporter
LigandBDBM50252074
Substrate/Competitorn/a
Meas. Tech.ChEMBL_487515 (CHEMBL1012267)
IC50 3±n/a nM
Citation Middleton, DSAndrews, MGlossop, PGymer, GHepworth, DJessiman, AJohnson, PSMackenny, MPitcher, MJRooker, TStobie, ATang, KMorgan, P Designing rapid onset selective serotonin re-uptake inhibitors. 2: structure-activity relationships of substituted (aryl)benzylamines. Bioorg Med Chem Lett18:4018-21 (2008) 
 
Sodium-dependent serotonin transporter
Name:Sodium-dependent serotonin transporter
Type:Multi-pass membrane protein
Mol. Mass.:70322.51
Organism:Homo sapiens (Human)
Description:P31645
Residue:630
BDBM50252074
NameBDBM50252074
Synonyms:CHEMBL482295 | N-(3-((dimethylamino)methyl)-4-(4-(trifluoromethyl)phenylthio)phenyl)methanesulfonamide
TypeSmall organic molecule
Emp. Form.C17H19F3N2O2S2
Mol. Mass.404.47
SMILESCN(C)Cc1cc(NS(C)(=O)=O)ccc1Sc1ccc(cc1)C(F)(F)F