Reaction Details
TargetSodium-dependent serotonin transporter
LigandBDBM50246181
Substrate/Competitorn/a
Meas. Tech.ChEMBL_487515 (CHEMBL1012267)
IC50 11±n/a nM
Citation Middleton, DSAndrews, MGlossop, PGymer, GHepworth, DJessiman, AJohnson, PSMackenny, MPitcher, MJRooker, TStobie, ATang, KMorgan, P Designing rapid onset selective serotonin re-uptake inhibitors. 2: structure-activity relationships of substituted (aryl)benzylamines. Bioorg Med Chem Lett18:4018-21 (2008) 
 
Sodium-dependent serotonin transporter
Name:Sodium-dependent serotonin transporter
Type:Multi-pass membrane protein
Mol. Mass.:70322.51
Organism:Homo sapiens (Human)
Description:P31645
Residue:630
BDBM50246181
NameBDBM50246181
Synonyms:(2-(3,4-dichlorophenoxy)phenyl)-N,N-dimethylmethanamine CHEMBL443922
TypeSmall organic molecule
Emp. Form.C15H15Cl2NO
Mol. Mass.296.192
SMILESCN(C)Cc1ccccc1Oc1ccc(Cl)c(Cl)c1