Reaction Details
TargetSodium-dependent serotonin transporter
LigandBDBM50252577
Substrate/Competitorn/a
Meas. Tech.ChEMBL_487515 (CHEMBL1012267)
IC50 250±n/a nM
Citation Middleton, DSAndrews, MGlossop, PGymer, GHepworth, DJessiman, AJohnson, PSMackenny, MPitcher, MJRooker, TStobie, ATang, KMorgan, P Designing rapid onset selective serotonin re-uptake inhibitors. 2: structure-activity relationships of substituted (aryl)benzylamines. Bioorg Med Chem Lett18:4018-21 (2008) 
 
Sodium-dependent serotonin transporter
Name:Sodium-dependent serotonin transporter
Type:Multi-pass membrane protein
Mol. Mass.:70322.51
Organism:Homo sapiens (Human)
Description:P31645
Residue:630
BDBM50252577
NameBDBM50252577
Synonyms:(+/-)-(3,4-dichlorophenyl)(2-((dimethylamino)methyl)phenyl)methanol | CHEMBL493476
TypeSmall organic molecule
Emp. Form.C16H17Cl2NO
Mol. Mass.310.218
SMILESCN(C)Cc1ccccc1C(O)c1ccc(Cl)c(Cl)c1