Reaction Details
TargetUrotensin-2 receptor
LigandBDBM50252310
Substrate/Competitorn/a
Meas. Tech.ChEMBL_487750 (CHEMBL1009482)
Ki 380±n/a nM
Citation Jin, JAn, MSapienza, AAiyar, NNaselsky, DSarau, HMFoley, JJSalyers, KLKnight, SDKeenan, RMRivero, RADhanak, DDouglas, SA Urotensin-II receptor antagonists: synthesis and SAR of N-cyclic azaalkyl benzamides. Bioorg Med Chem Lett18:3950-4 (2008) 
 
Urotensin-2 receptor
Name:Urotensin-2 receptor
Type:Enzyme Catalytic Domain
Mol. Mass.:42159.71
Organism:Homo sapiens (Human)
Description:Urotensin-II UTS2R HUMAN::Q9UKP6
Residue:389
BDBM50252310
NameBDBM50252310
Synonyms:(R)-N-(1-(3-bromo-4-(piperidin-4-yloxy)phenylsulfonyl)pyrrolidin-3-yl)-3,4-dichlorobenzamide | CHEMBL481964
TypeSmall organic molecule
Emp. Form.C22H24BrCl2N3O4S
Mol. Mass.577.319
SMILESClc1ccc(cc1Cl)C(=O)N[C@@H]1CCN(C1)S(=O)(=O)c1ccc(OC2CCNCC2)c(Br)c1