Reaction Details
TargetUrotensin-2 receptor
LigandBDBM50252196
Substrate/Competitorn/a
Meas. Tech.ChEMBL_487750 (CHEMBL1009482)
Ki 230±n/a nM
Citation Jin, JAn, MSapienza, AAiyar, NNaselsky, DSarau, HMFoley, JJSalyers, KLKnight, SDKeenan, RMRivero, RADhanak, DDouglas, SA Urotensin-II receptor antagonists: synthesis and SAR of N-cyclic azaalkyl benzamides. Bioorg Med Chem Lett18:3950-4 (2008) 
 
Urotensin-2 receptor
Name:Urotensin-2 receptor
Type:Enzyme Catalytic Domain
Mol. Mass.:42159.71
Organism:Homo sapiens (Human)
Description:Urotensin-II UTS2R HUMAN::Q9UKP6
Residue:389
BDBM50252196
NameBDBM50252196
Synonyms:(S)-N-(1-(4-(1-benzylpiperidin-4-yloxy)-3-bromobenzyl)pyrrolidin-3-yl)-3,4-dichlorobenzamide | CHEMBL479993
TypeSmall organic molecule
Emp. Form.C30H32BrCl2N3O2
Mol. Mass.617.404
SMILESClc1ccc(cc1Cl)C(=O)N[C@H]1CCN(Cc2ccc(OC3CCN(Cc4ccccc4)CC3)c(Br)c2)C1