Reaction Details
TargetUrotensin-2 receptor
LigandBDBM50252147
Substrate/Competitorn/a
Meas. Tech.ChEMBL_487750 (CHEMBL1009482)
Ki 5.5±n/a nM
Citation Jin, JAn, MSapienza, AAiyar, NNaselsky, DSarau, HMFoley, JJSalyers, KLKnight, SDKeenan, RMRivero, RADhanak, DDouglas, SA Urotensin-II receptor antagonists: synthesis and SAR of N-cyclic azaalkyl benzamides. Bioorg Med Chem Lett18:3950-4 (2008) 
 
Urotensin-2 receptor
Name:Urotensin-2 receptor
Type:Enzyme Catalytic Domain
Mol. Mass.:42159.71
Organism:Homo sapiens (Human)
Description:Urotensin-II UTS2R HUMAN::Q9UKP6
Residue:389
BDBM50252147
NameBDBM50252147
Synonyms:CHEMBL482259 | N-((S)-1-((R)-3-bromo-4-((R)-pyrrolidin-3-yloxy)benzyl)pyrrolidin-3-yl)-3,4-dichlorobenzamide
TypeSmall organic molecule
Emp. Form.C22H24BrCl2N3O2
Mol. Mass.513.255
SMILESClc1ccc(cc1Cl)C(=O)N[C@H]1CCN(Cc2ccc(O[C@@H]3CCNC3)c(Br)c2)C1