Reaction Details
TargetUrotensin-2 receptor
LigandBDBM50252146
Substrate/Competitorn/a
Meas. Tech.ChEMBL_487750 (CHEMBL1009482)
Ki 1500±n/a nM
Citation Jin, JAn, MSapienza, AAiyar, NNaselsky, DSarau, HMFoley, JJSalyers, KLKnight, SDKeenan, RMRivero, RADhanak, DDouglas, SA Urotensin-II receptor antagonists: synthesis and SAR of N-cyclic azaalkyl benzamides. Bioorg Med Chem Lett18:3950-4 (2008) 
 
Urotensin-2 receptor
Name:Urotensin-2 receptor
Type:Enzyme Catalytic Domain
Mol. Mass.:42159.71
Organism:Homo sapiens (Human)
Description:Urotensin-II UTS2R HUMAN::Q9UKP6
Residue:389
BDBM50252146
NameBDBM50252146
Synonyms:(S)-N-(1-(3-bromo-4-(2-(piperazin-1-yl)ethoxy)benzyl)pyrrolidin-3-yl)-3,4-dichlorobenzamide | CHEMBL482258
TypeSmall organic molecule
Emp. Form.C24H29BrCl2N4O2
Mol. Mass.556.323
SMILESClc1ccc(cc1Cl)C(=O)N[C@H]1CCN(Cc2ccc(OCCN3CCNCC3)c(Br)c2)C1