Reaction Details
TargetUrotensin-2 receptor
LigandBDBM50252041
Substrate/Competitorn/a
Meas. Tech.ChEMBL_487750 (CHEMBL1009482)
Ki 97±n/a nM
Citation Jin, JAn, MSapienza, AAiyar, NNaselsky, DSarau, HMFoley, JJSalyers, KLKnight, SDKeenan, RMRivero, RADhanak, DDouglas, SA Urotensin-II receptor antagonists: synthesis and SAR of N-cyclic azaalkyl benzamides. Bioorg Med Chem Lett18:3950-4 (2008) 
 
Urotensin-2 receptor
Name:Urotensin-2 receptor
Type:Enzyme Catalytic Domain
Mol. Mass.:42159.71
Organism:Homo sapiens (Human)
Description:Urotensin-II UTS2R HUMAN::Q9UKP6
Residue:389
BDBM50252041
NameBDBM50252041
Synonyms:(+/-)-N-(1-(4-(1-methylpyrrolidin-3-yloxy)benzyl)pyrrolidin-3-yl)-3,4-dichlorobenzamide | CHEMBL518949
TypeSmall organic molecule
Emp. Form.C23H27Cl2N3O2
Mol. Mass.448.385
SMILESCN1CCC(C1)Oc1ccc(CN2CCC(C2)NC(=O)c2ccc(Cl)c(Cl)c2)cc1