Reaction Details
TargetUrotensin-2 receptor
LigandBDBM50252040
Substrate/Competitorn/a
Meas. Tech.ChEMBL_487750 (CHEMBL1009482)
Ki>10000±n/a nM
Citation Jin, JAn, MSapienza, AAiyar, NNaselsky, DSarau, HMFoley, JJSalyers, KLKnight, SDKeenan, RMRivero, RADhanak, DDouglas, SA Urotensin-II receptor antagonists: synthesis and SAR of N-cyclic azaalkyl benzamides. Bioorg Med Chem Lett18:3950-4 (2008) 
 
Urotensin-2 receptor
Name:Urotensin-2 receptor
Type:Enzyme Catalytic Domain
Mol. Mass.:42159.71
Organism:Homo sapiens (Human)
Description:Urotensin-II UTS2R HUMAN::Q9UKP6
Residue:389
BDBM50252040
NameBDBM50252040
Synonyms:(S)-N-(1-(2-(3-(dimethylamino)propoxy)benzyl)pyrrolidin-3-yl)-3,4-dichlorobenzamide | CHEMBL479612
TypeSmall organic molecule
Emp. Form.C23H29Cl2N3O2
Mol. Mass.450.401
SMILESCN(C)CCCOc1ccccc1CN1CC[C@@H](C1)NC(=O)c1ccc(Cl)c(Cl)c1