Reaction Details
TargetUrotensin-2 receptor
LigandBDBM50251944
Substrate/Competitorn/a
Meas. Tech.ChEMBL_487750 (CHEMBL1009482)
Ki 350±n/a nM
Citation Jin, JAn, MSapienza, AAiyar, NNaselsky, DSarau, HMFoley, JJSalyers, KLKnight, SDKeenan, RMRivero, RADhanak, DDouglas, SA Urotensin-II receptor antagonists: synthesis and SAR of N-cyclic azaalkyl benzamides. Bioorg Med Chem Lett18:3950-4 (2008) 
 
Urotensin-2 receptor
Name:Urotensin-2 receptor
Type:Enzyme Catalytic Domain
Mol. Mass.:42159.71
Organism:Homo sapiens (Human)
Description:Urotensin-II UTS2R HUMAN::Q9UKP6
Residue:389
BDBM50251944
NameBDBM50251944
Synonyms:(R)-N-(1-(4-(3-(dimethylamino)propoxy)benzyl)pyrrolidin-3-yl)-4-bromobenzamide | CHEMBL480170
TypeSmall organic molecule
Emp. Form.C23H30BrN3O2
Mol. Mass.460.407
SMILESCN(C)CCCOc1ccc(CN2CC[C@H](C2)NC(=O)c2ccc(Br)cc2)cc1