Reaction Details
TargetTyrosine-protein phosphatase non-receptor type 1
LigandBDBM50149232
Substrate/Competitorn/a
Meas. Tech.ChEMBL_490537 (CHEMBL981143)
Ki 22±n/a nM
Citation Ling, QHuang, YZhou, YCai, ZXiong, BZhang, YMa, LWang, XLi, XLi, JShen, J Illudalic acid as a potential LAR inhibitor: synthesis, SAR, and preliminary studies on the mechanism of action. Bioorg Med Chem16:7399-409 (2008) 
 
Tyrosine-protein phosphatase non-receptor type 1
Name:Tyrosine-protein phosphatase non-receptor type 1
Type:Protein phosphatase
Mol. Mass.:49963.76
Organism:Homo sapiens (Human)
Description:Human recombinant GST-fusion PTP1B (1-435).
Residue:435
BDBM50149232
NameBDBM50149232
Synonyms:3-(5-(2-acetamido-3-(4-(carboxy-N-(2-carboxyphenyl)formamido))naphthalen-1-yl)propanamido)pentyloxy)-2-naphthoic acid CHEMBL324968
TypeSmall organic molecule
Emp. Form.C40H37N3O10
Mol. Mass.719.7359
SMILESCC(=O)NC(Cc1ccc(N(C(=O)C(O)=O)c2ccccc2C(O)=O)c2ccccc12)C(=O)NCCCCCOc1cc2ccccc2cc1C(O)=O