Reaction Details
TargetReceptor-type tyrosine-protein phosphatase F
LigandBDBM50263036
Substrate/Competitorn/a
Meas. Tech.ChEMBL_490539 (CHEMBL981145)
IC50 1530±n/a nM
Citation Ling, QHuang, YZhou, YCai, ZXiong, BZhang, YMa, LWang, XLi, XLi, JShen, J Illudalic acid as a potential LAR inhibitor: synthesis, SAR, and preliminary studies on the mechanism of action. Bioorg Med Chem16:7399-409 (2008) 
 
Receptor-type tyrosine-protein phosphatase F
Name:Receptor-type tyrosine-protein phosphatase F
Type:Protein
Mol. Mass.:212869.85
Organism:Homo sapiens (Human)
Description:P10586
Residue:1907
BDBM50263036
NameBDBM50263036
Synonyms:3-Hydroxy-6-methoxy-8,8-dimethyl-1-oxo-1,3,4,7,8,9-hexahydro-cyclopenta[h]isochromene-5-carbaldehyde | CHEMBL518277
TypeSmall organic molecule
Emp. Form.C16H18O5
Mol. Mass.290.3111
SMILESCOc1c2CC(C)(C)Cc2c2C(=O)OC(O)Cc2c1C=O