Reaction Details
TargetProgesterone receptor
LigandBDBM50251774
Substrate/Competitorn/a
Meas. Tech.ChEMBL_488146 (CHEMBL987437)
IC50 78±n/a nM
Citation Nakagawa, AUno, SMakishima, MMiyachi, HHashimoto, Y Progesterone receptor antagonists with a 3-phenylquinazoline-2,4-dione/2-phenylisoquinoline-1,3-dione skeleton. Bioorg Med Chem16:7046-54 (2008) 
 
Progesterone receptor
Name:Progesterone receptor
Type:Protein
Mol. Mass.:98979.52
Organism:Homo sapiens (Human)
Description:P06401
Residue:933
BDBM50251774
NameBDBM50251774
Synonyms:4-(4,4-Diethyl-3,4-dihydro-1,3-dioxoisoquinolin-2(1H)-yl) benzonitrile | CHEMBL479581
TypeSmall organic molecule
Emp. Form.C20H18N2O2
Mol. Mass.318.3691
SMILESCCC1(CC)C(=O)N(C(=O)c2ccccc12)c1ccc(cc1)C#N