Reaction Details
TargetHistamine H3 receptor
LigandBDBM50262747
Substrate/Competitorn/a
Meas. Tech.ChEMBL_489014 (CHEMBL986355)
IC50 0.720000±n/a nM
Citation Nagase, TMizutani, TIshikawa, SSekino, ESasaki, TFujimura, TIto, SMitobe, YMiyamoto, YYoshimoto, RTanaka, TIshihara, ATakenaga, NTokita, SFukami, TSato, N Synthesis, structure-activity relationships, and biological profiles of a quinazolinone class of histamine H3 receptor inverse agonists. J Med Chem51:4780-9 (2008) 
 
Histamine H3 receptor
Name:Histamine H3 receptor
Type:G Protein-Coupled Receptor (GPCR)
Mol. Mass.:48691.47
Organism:Homo sapiens (Human)
Description:Binding assays were using CHO cells stably expressing hH3R receptors.
Residue:445
BDBM50262747
NameBDBM50262747
Synonyms:2-Methyl-3-[4-({3-[(3S)-3-methyl-1-piperidinyl]propyl}oxy)phenyl]-4(3H)-quinazolinone | CHEMBL478395
TypeSmall organic molecule
Emp. Form.C24H29N3O2
Mol. Mass.391.506
SMILESC[C@H]1CCCN(CCCOc2ccc(cc2)-n2c(C)nc3ccccc3c2=O)C1