Reaction Details
TargetHistamine H3 receptor
LigandBDBM50262587
Substrate/Competitorn/a
Meas. Tech.ChEMBL_489014 (CHEMBL986355)
IC50 20±n/a nM
Citation Nagase, TMizutani, TIshikawa, SSekino, ESasaki, TFujimura, TIto, SMitobe, YMiyamoto, YYoshimoto, RTanaka, TIshihara, ATakenaga, NTokita, SFukami, TSato, N Synthesis, structure-activity relationships, and biological profiles of a quinazolinone class of histamine H3 receptor inverse agonists. J Med Chem51:4780-9 (2008) 
 
Histamine H3 receptor
Name:Histamine H3 receptor
Type:G Protein-Coupled Receptor (GPCR)
Mol. Mass.:48691.47
Organism:Homo sapiens (Human)
Description:Binding assays were using CHO cells stably expressing hH3R receptors.
Residue:445
BDBM50262587
NameBDBM50262587
Synonyms:3-[4-({3-[(2R,5R)-2,5-Dimethyl-1-pyrrolidinyl]propyl}oxy)phenyl]-4(3H)-quinazolinone | CHEMBL443958
TypeSmall organic molecule
Emp. Form.C24H29N3O2
Mol. Mass.391.506
SMILESC[C@@H]1CC[C@@H](C)N1CCCOc1ccc(cc1)-n1c(C)nc2ccccc2c1=O