Reaction Details
TargetPotassium voltage-gated channel subfamily H member 2
LigandBDBM50262747
Substrate/Competitorn/a
Meas. Tech.ChEMBL_489010 (CHEMBL986351)
IC50 5300±n/a nM
Citation Nagase, TMizutani, TIshikawa, SSekino, ESasaki, TFujimura, TIto, SMitobe, YMiyamoto, YYoshimoto, RTanaka, TIshihara, ATakenaga, NTokita, SFukami, TSato, N Synthesis, structure-activity relationships, and biological profiles of a quinazolinone class of histamine H3 receptor inverse agonists. J Med Chem51:4780-9 (2008) 
 
Potassium voltage-gated channel subfamily H member 2
Name:Potassium voltage-gated channel subfamily H member 2
Type:Multi-pass membrane protein
Mol. Mass.:126672.65
Organism:Homo sapiens (Human)
Description:Q12809
Residue:1159
BDBM50262747
NameBDBM50262747
Synonyms:2-Methyl-3-[4-({3-[(3S)-3-methyl-1-piperidinyl]propyl}oxy)phenyl]-4(3H)-quinazolinone | CHEMBL478395
TypeSmall organic molecule
Emp. Form.C24H29N3O2
Mol. Mass.391.506
SMILESC[C@H]1CCCN(CCCOc2ccc(cc2)-n2c(C)nc3ccccc3c2=O)C1