Reaction Details
TargetPotassium voltage-gated channel subfamily H member 2
LigandBDBM50262751
Substrate/Competitorn/a
Meas. Tech.ChEMBL_489010 (CHEMBL986351)
IC50 710±n/a nM
Citation Nagase, TMizutani, TIshikawa, SSekino, ESasaki, TFujimura, TIto, SMitobe, YMiyamoto, YYoshimoto, RTanaka, TIshihara, ATakenaga, NTokita, SFukami, TSato, N Synthesis, structure-activity relationships, and biological profiles of a quinazolinone class of histamine H3 receptor inverse agonists. J Med Chem51:4780-9 (2008) 
 
Potassium voltage-gated channel subfamily H member 2
Name:Potassium voltage-gated channel subfamily H member 2
Type:Multi-pass membrane protein
Mol. Mass.:126672.65
Organism:Homo sapiens (Human)
Description:Q12809
Residue:1159
BDBM50262751
NameBDBM50262751
Synonyms:3-(4-{[3-(1-Pyrrolidinyl)propyl]oxy}phenyl)-4(3H)-quinazolinone | CHEMBL518431
TypeSmall organic molecule
Emp. Form.C21H23N3O2
Mol. Mass.349.4262
SMILESO=c1n(cnc2ccccc12)-c1ccc(OCCCN2CCCC2)cc1