Reaction Details
TargetPotassium voltage-gated channel subfamily H member 2
LigandBDBM50262883
Substrate/Competitorn/a
Meas. Tech.ChEMBL_489010 (CHEMBL986351)
IC50>10000±n/a nM
Citation Nagase, TMizutani, TIshikawa, SSekino, ESasaki, TFujimura, TIto, SMitobe, YMiyamoto, YYoshimoto, RTanaka, TIshihara, ATakenaga, NTokita, SFukami, TSato, N Synthesis, structure-activity relationships, and biological profiles of a quinazolinone class of histamine H3 receptor inverse agonists. J Med Chem51:4780-9 (2008) 
 
Potassium voltage-gated channel subfamily H member 2
Name:Potassium voltage-gated channel subfamily H member 2
Type:Multi-pass membrane protein
Mol. Mass.:126672.65
Organism:Homo sapiens (Human)
Description:Q12809
Residue:1159
BDBM50262883
NameBDBM50262883
Synonyms:8-Methoxy-2-methyl-3-(4-{[3-(1-pyrrolidinyl)propyl]oxy}phenyl)-4(3H)-quinazolinone trifluoroacetate | CHEMBL477152
TypeSmall organic molecule
Emp. Form.C23H27N3O3
Mol. Mass.393.4788
SMILESCOc1cccc2c1nc(C)n(-c1ccc(OCCCN3CCCC3)cc1)c2=O