Reaction Details
TargetType-1 angiotensin II receptor
LigandBDBM50049189
Substrate/Competitorn/a
Meas. Tech.ChEMBL_488661 (CHEMBL988351)
Ki 2±n/a nM
Citation Wallinder, CBotros, MRosenström, UGuimond, MOBeaudry, HNyberg, FGallo-Payet, NHallberg, AAlterman, M Selective angiotensin II AT2 receptor agonists: Benzamide structure-activity relationships. Bioorg Med Chem16:6841-9 (2008) 
 
Type-1 angiotensin II receptor
Name:Type-1 angiotensin II receptor
Type:PROTEIN
Mol. Mass.:40925.99
Organism:Sus scrofa
Description:ChEMBL_488661
Residue:359
BDBM50049189
NameBDBM50049189
Synonyms:3-[4-(2-Ethyl-57-dimethyl-imidazo[45-b]pyridin-3-ylmethyl)-phenyl]-5-isobutyl-thiophene-2-sulfonic acid butyloxycarbonylamide(L-162313) L-162313 | butyl 3-(4-((2-ethyl-5,7-dimethyl-3H-imidazo[4,5-b]pyridin-3-yl)methyl)phenyl)-5-isobutylthiophen-2-ylsulfonylcarbamate
TypeSmall organic molecule
Emp. Form.C30H38N4O4S2
Mol. Mass.582.777
SMILESCCCCOC(=O)NS(=O)(=O)c1sc(CC(C)C)cc1-c1ccc(Cn2c(CC)nc3c(C)cc(C)nc23)cc1