Reaction Details
TargetType-1 angiotensin II receptor
LigandBDBM50199326
Substrate/Competitorn/a
Meas. Tech.ChEMBL_488661 (CHEMBL988351)
Ki 0.7±n/a nM
Citation Wallinder, CBotros, MRosenström, UGuimond, MOBeaudry, HNyberg, FGallo-Payet, NHallberg, AAlterman, M Selective angiotensin II AT2 receptor agonists: Benzamide structure-activity relationships. Bioorg Med Chem16:6841-9 (2008) 
 
Type-1 angiotensin II receptor
Name:Type-1 angiotensin II receptor
Type:PROTEIN
Mol. Mass.:40925.99
Organism:Sus scrofa
Description:ChEMBL_488661
Residue:359
BDBM50199326
NameBDBM50199326
Synonyms:CHEMBL217673 | N-butyloxycarbonyl-2-(4-imidazol-1-ylmethylphenyl)-4-iso-butylbenzenesulfonamide
TypeSmall organic molecule
Emp. Form.C25H31N3O4S
Mol. Mass.469.596
SMILESCCCCOC(=O)NS(=O)(=O)c1ccc(CC(C)C)cc1-c1ccc(Cn2ccnc2)cc1