Reaction Details
TargetType-1 angiotensin II receptor
LigandBDBM50251488
Substrate/Competitorn/a
Meas. Tech.ChEMBL_488661 (CHEMBL988351)
Ki 3±n/a nM
Citation Wallinder, CBotros, MRosenström, UGuimond, MOBeaudry, HNyberg, FGallo-Payet, NHallberg, AAlterman, M Selective angiotensin II AT2 receptor agonists: Benzamide structure-activity relationships. Bioorg Med Chem16:6841-9 (2008) 
 
Type-1 angiotensin II receptor
Name:Type-1 angiotensin II receptor
Type:PROTEIN
Mol. Mass.:40925.99
Organism:Sus scrofa
Description:ChEMBL_488661
Residue:359
BDBM50251488
NameBDBM50251488
Synonyms:CHEMBL521093 | N-Butoxycarbonyl-3-[4-(N,N-diethylcarbamoyl)phenyl]-5-isobutylthiophene-2-sulfonamide
TypeSmall organic molecule
Emp. Form.C24H34N2O5S2
Mol. Mass.494.667
SMILESCCCCOC(=O)NS(=O)(=O)c1sc(CC(C)C)cc1-c1ccc(cc1)C(=O)N(CC)CC