Reaction Details
TargetType-1 angiotensin II receptor
LigandBDBM50141059
Substrate/Competitorn/a
Meas. Tech.ChEMBL_488661 (CHEMBL988351)
Ki 0.7±n/a nM
Citation Wallinder, CBotros, MRosenström, UGuimond, MOBeaudry, HNyberg, FGallo-Payet, NHallberg, AAlterman, M Selective angiotensin II AT2 receptor agonists: Benzamide structure-activity relationships. Bioorg Med Chem16:6841-9 (2008) 
 
Type-1 angiotensin II receptor
Name:Type-1 angiotensin II receptor
Type:PROTEIN
Mol. Mass.:40925.99
Organism:Sus scrofa
Description:ChEMBL_488661
Residue:359
BDBM50141059
NameBDBM50141059
Synonyms:CHEMBL289614 N-Butyloxycarbonyl-4'-(2-Ethyl-5,7-dimethyl-imidazo[4,5-b]pyridin-3-ylmethyl)-5-isobutyl-biphenyl-2-sulfonic acid amide
TypeSmall organic molecule
Emp. Form.C32H40N4O4S
Mol. Mass.576.749
SMILESCCCCOC(=O)NS(=O)(=O)c1ccc(CC(C)C)cc1-c1ccc(Cn2c(CC)nc3c(C)cc(C)nc23)cc1