Reaction Details
Target5-hydroxytryptamine receptor 2C
LigandBDBM50251647
Substrate/Competitorn/a
Meas. Tech.ChEMBL_488674 (CHEMBL988364)
IC50 0.5±n/a nM
Citation Park, CMKim, SYPark, WKPark, NSSeong, CM Synthesis and structure-activity relationship of 1H-indole-3-carboxylic acid pyridine-3-ylamides: a novel series of 5-HT2C receptor antagonists. Bioorg Med Chem Lett18:3844-7 (2008) 
 
5-hydroxytryptamine receptor 2C
Name:5-hydroxytryptamine receptor 2C
Type:G Protein-Coupled Receptor (GPCR)
Mol. Mass.:51836.79
Organism:Homo sapiens (Human)
Description:P28335
Residue:458
BDBM50251647
NameBDBM50251647
Synonyms:1H-indole-3-carboxylic acid[6-(2-chloro-pyridin-3-yloxy)-pyridin-3-yl]-amide | CHEMBL516452
TypeSmall organic molecule
Emp. Form.C19H13ClN4O2
Mol. Mass.364.785
SMILESClc1ncccc1Oc1ccc(NC(=O)c2c[nH]c3ccccc23)cn1