Reaction Details
TargetCholecystokinin receptor type A
LigandBDBM50263185
Substrate/Competitorn/a
Meas. Tech.ChEMBL_490133 (CHEMBL994438)
EC50 0.13±n/a nM
Citation Zhu, CHansen, ARBateman, TChen, ZHolt, TGHubert, JAKaranam, BVLee, SJPan, JQian, SReddy, VBReitman, MLStrack, AMTong, VWeingarth, DTWolff, MSMacNeil, DJWeber, AEDuffy, JLEdmondson, SD Discovery of imidazole carboxamides as potent and selective CCK1R agonists. Bioorg Med Chem Lett18:4393-6 (2008) 
 
Cholecystokinin receptor type A
Name:Cholecystokinin receptor type A
Type:G Protein-Coupled Receptor (GPCR)
Mol. Mass.:47859.34
Organism:Homo sapiens (Human)
Description:Stable expression of human CCK-1 receptors in HEK 293 cells.
Residue:428
BDBM50263185
NameBDBM50263185
Synonyms:(1-(3-ethoxyphenyl)-2-(2-fluoro-4-methylphenyl)-1H-imidazol-4-yl)(4-(quinolin-3-yl)piperazin-1-yl)methanone | CHEMBL474067
TypeSmall organic molecule
Emp. Form.C32H30FN5O2
Mol. Mass.535.6113
SMILESCCOc1cccc(c1)-n1cc(nc1-c1ccc(C)cc1F)C(=O)N1CCN(CC1)c1cnc2ccccc2c1