Reaction Details
TargetCholecystokinin receptor type A
LigandBDBM50262972
Substrate/Competitorn/a
Meas. Tech.ChEMBL_490135 (CHEMBL994440)
IC50 200±n/a nM
Citation Zhu, CHansen, ARBateman, TChen, ZHolt, TGHubert, JAKaranam, BVLee, SJPan, JQian, SReddy, VBReitman, MLStrack, AMTong, VWeingarth, DTWolff, MSMacNeil, DJWeber, AEDuffy, JLEdmondson, SD Discovery of imidazole carboxamides as potent and selective CCK1R agonists. Bioorg Med Chem Lett18:4393-6 (2008) 
 
Cholecystokinin receptor type A
Name:Cholecystokinin receptor type A
Type:G Protein-Coupled Receptor (GPCR)
Mol. Mass.:47859.34
Organism:Homo sapiens (Human)
Description:Stable expression of human CCK-1 receptors in HEK 293 cells.
Residue:428
BDBM50262972
NameBDBM50262972
Synonyms:(4-(naphthalen-2-yl)piperazin-1-yl)(2-p-tolyl-1-(3-(2,2,2-trifluoroethoxy)phenyl)-1H-imidazol-4-yl)methanone | CHEMBL448597
TypeSmall organic molecule
Emp. Form.C33H29F3N4O2
Mol. Mass.570.6042
SMILESCc1ccc(cc1)-c1nc(cn1-c1cccc(OCC(F)(F)F)c1)C(=O)N1CCN(CC1)c1ccc2ccccc2c1