Reaction Details
TargetCholecystokinin receptor type A
LigandBDBM50262913
Substrate/Competitorn/a
Meas. Tech.ChEMBL_490135 (CHEMBL994440)
IC50 22±n/a nM
Citation Zhu, CHansen, ARBateman, TChen, ZHolt, TGHubert, JAKaranam, BVLee, SJPan, JQian, SReddy, VBReitman, MLStrack, AMTong, VWeingarth, DTWolff, MSMacNeil, DJWeber, AEDuffy, JLEdmondson, SD Discovery of imidazole carboxamides as potent and selective CCK1R agonists. Bioorg Med Chem Lett18:4393-6 (2008) 
 
Cholecystokinin receptor type A
Name:Cholecystokinin receptor type A
Type:G Protein-Coupled Receptor (GPCR)
Mol. Mass.:47859.34
Organism:Homo sapiens (Human)
Description:Stable expression of human CCK-1 receptors in HEK 293 cells.
Residue:428
BDBM50262913
NameBDBM50262913
Synonyms:(1-(3-hydroxyphenyl)-2-p-tolyl-1H-imidazol-4-yl)(4-(naphthalen-2-yl)piperazin-1-yl)methanone | CHEMBL476297
TypeSmall organic molecule
Emp. Form.C31H28N4O2
Mol. Mass.488.5796
SMILESCc1ccc(cc1)-c1nc(cn1-c1cccc(O)c1)C(=O)N1CCN(CC1)c1ccc2ccccc2c1