Reaction Details
TargetCyclin-dependent kinase 2
LigandBDBM50263070
Substrate/Competitorn/a
Meas. Tech.ChEMBL_490603 (CHEMBL984724)
IC50 17±n/a nM
Citation Finlay, MRActon, DGAndrews, DMBarker, AJDennis, MFisher, EGraham, MAGreen, CPHeaton, DWKaroutchi, GLoddick, SAMorgentin, RRoberts, ATucker, JAWeir, HM Imidazole piperazines: SAR and development of a potent class of cyclin-dependent kinase inhibitors with a novel binding mode. Bioorg Med Chem Lett18:4442-6 (2008) 
 
Cyclin-dependent kinase 2
Name:Cyclin-dependent kinase 2
Type:Enzyme Subunit
Mol. Mass.:33938.17
Organism:Homo sapiens (Human)
Description:P24941
Residue:298
BDBM50263070
NameBDBM50263070
Synonyms:2-hydroxy-1-(4-(4-(4-(1-isopropyl-2-methyl-1H-imidazol-5-yl)pyrimidin-2-ylamino)phenyl)piperazin-1-yl)ethanone CHEMBL477786
TypeSmall organic molecule
Emp. Form.C23H29N7O2
Mol. Mass.435.5221
SMILESCC(C)n1c(C)ncc1-c1ccnc(Nc2ccc(cc2)N2CCN(CC2)C(=O)CO)n1