Reaction Details
TargetPotassium voltage-gated channel subfamily H member 2
LigandBDBM50263070
Substrate/Competitorn/a
Meas. Tech.ChEMBL_490606 (CHEMBL984727)
IC50>24000±n/a nM
Citation Finlay, MRActon, DGAndrews, DMBarker, AJDennis, MFisher, EGraham, MAGreen, CPHeaton, DWKaroutchi, GLoddick, SAMorgentin, RRoberts, ATucker, JAWeir, HM Imidazole piperazines: SAR and development of a potent class of cyclin-dependent kinase inhibitors with a novel binding mode. Bioorg Med Chem Lett18:4442-6 (2008) 
 
Potassium voltage-gated channel subfamily H member 2
Name:Potassium voltage-gated channel subfamily H member 2
Type:Multi-pass membrane protein
Mol. Mass.:126672.65
Organism:Homo sapiens (Human)
Description:Q12809
Residue:1159
BDBM50263070
NameBDBM50263070
Synonyms:2-hydroxy-1-(4-(4-(4-(1-isopropyl-2-methyl-1H-imidazol-5-yl)pyrimidin-2-ylamino)phenyl)piperazin-1-yl)ethanone CHEMBL477786
TypeSmall organic molecule
Emp. Form.C23H29N7O2
Mol. Mass.435.5221
SMILESCC(C)n1c(C)ncc1-c1ccnc(Nc2ccc(cc2)N2CCN(CC2)C(=O)CO)n1