Reaction Details
TargetCyclin-dependent kinase 2
LigandBDBM50263149
Substrate/Competitorn/a
Meas. Tech.ChEMBL_490603 (CHEMBL984724)
IC50 46±n/a nM
Citation Finlay, MRActon, DGAndrews, DMBarker, AJDennis, MFisher, EGraham, MAGreen, CPHeaton, DWKaroutchi, GLoddick, SAMorgentin, RRoberts, ATucker, JAWeir, HM Imidazole piperazines: SAR and development of a potent class of cyclin-dependent kinase inhibitors with a novel binding mode. Bioorg Med Chem Lett18:4442-6 (2008) 
 
Cyclin-dependent kinase 2
Name:Cyclin-dependent kinase 2
Type:Enzyme Subunit
Mol. Mass.:33938.17
Organism:Homo sapiens (Human)
Description:P24941
Residue:298
BDBM50263149
NameBDBM50263149
Synonyms:(2S)-1-(4-(5-fluoro-4-(1-isopropyl-2-methyl-1H-imidazol-5-yl)pyrimidin-2-ylamino)phenyl)-N,N-dimethylpyrrolidine-2-carboxamide | CHEMBL475948
TypeSmall organic molecule
Emp. Form.C24H30FN7O
Mol. Mass.451.5397
SMILESCC(C)n1c(C)ncc1-c1nc(Nc2ccc(cc2)N2CCC[C@H]2C(=O)N(C)C)ncc1F